Sheriff
type: Concept
type: person
definition: Britischer Medailleur in Liverpool in der ersten Hälfte des 19. Jahrhunderts.Lit.: L. Forrer, Biographical Dictionary of Medallists V (1912) 495.
gender: male
surname: Sheriff
function or role: Medailleur/in
in scheme: person
created: 2025-12-10
modified: 2025-12-10
creator: mk berlin

Medailleur/in
preferred label: Medalist @en