Luigi Seregni
type: Concept
type: person
definition: Italienischer Medailleur.Lit.: L. Forrer, Biographical Dictionary of Medallists V (1912) 477 f.
gender: male
forename: Luigi
surname: Seregni
date of birth: 1819
date of birth and death: 1819-
function or role: Medailleur/in
in scheme: person
created: 2025-12-10
modified: 2025-12-10
creator: mk berlin

Medailleur/in
preferred label: Medalist @en