Al. Schindler
type: Concept
type: person
definition: Medailleur in Lemberg/Lwow (und Krakau/Krakow?), belegt in den 1880 und 1890 Jahren.Signiert mit A. SCHINDLER.Lit.: L. Forrer, Biographical Dictionary of Medallists V (1912) 385.
gender: male
forename: Al.
surname: Schindler
function or role: Medailleur/in
in scheme: person
created: 2025-12-11
creator: mk berlin

Medailleur/in
preferred label: Medalist @en