Prof. Dr. Richard von Krafft-Ebing
type: Concept
type: person
definition: Richard Fridolin Joseph Freiherr Krafft von Festenberg auf Frohnberg, genannt von EbingÖsterreichischer Neurologe, Psychiater, und Adeliger.
gender: male
prefix: Prof. Dr.
forename: Richard von
surname: Krafft-Ebing
date of birth: 1840
date of death: 1902
date of birth and death: 14.08.1840 - 22.12.1902
function or role: Dargestellte/r
in scheme: person
created: 2025-12-11
creator: mk berlin

Dargestellte/r
preferred label: Sitter @en