Albert Jaegers
type: Concept
type: person
definition: Deutsch-Amerikanischer Bildhauer und Medailleur.
gender: male
forename: Albert
surname: Jaegers
date of birth: 1868
date of death: 1925
date of birth and death: 28.03.1868 - 22.07.1925
function or role: Medailleur/in
in scheme: person
created: 2025-12-11
modified: 2025-12-11
creator: mk berlin

Medailleur/in
preferred label: Medalist @en