Generalmajor Friedrich Wilhelm von Steuben
type: Concept
type: person
preferred label: Major General Friedrich Wilhelm von Steuben @en
definition: Preußischer Offizier und General der Kontinentalarmee der Vereinigten Staaten.
gender: male
prefix: Generalmajor
prefix: Major General @en
forename: Friedrich Wilhelm von
surname: Steuben
date of birth: 1730
date of death: 1794
date of birth and death: 17.09.1730 - 28.11.1794
function or role: Dargestellte/r
in scheme: person
created: 2025-12-11
creator: mk berlin

Dargestellte/r
preferred label: Sitter @en