Carl Schurz
type: Concept
type: person
definition: Deutscher Revolutionär des Jahres 1848 und General der Nordstaaten im amerikanischen Bürgerkrieg.
gender: male
forename: Carl
surname: Schurz
date of birth: 1829
date of death: 1906
date of birth and death: 02.03.1829 - 14.05.1906
function or role: Dargestellte/r
in scheme: person
created: 2025-12-11
modified: 2025-12-15
creator: mk berlin

Dargestellte/r
preferred label: Sitter @en