Fritz Beiersdorf
type: Concept
type: person
definition: Oberregierungrat Fritz Beiersdorf in Berlin.Geschenk an das Münzkabinett Berlin im Jahre 1935.
gender: male
forename: Fritz
surname: Beiersdorf
function or role: Vorbesitzer
in scheme: person
created: 2025-12-21
creator: mk berlin

Vorbesitzer
preferred label: previous Owner @en