Ercole Lelli
type: Concept
type: person
definition: Italienischer Anatom, Bildhauer und Maler.
gender: male
forename: Ercole
surname: Lelli
date of birth: 1702
date of death: 1788
date of birth and death: 14.09.1702 - 07.03.1766
function or role: Dargestellte/r
in scheme: person
created: 2026-01-06
creator: mk berlin

Dargestellte/r
preferred label: Sitter @en