Bse...
type: Concept
type: person
definition: Magistrat (?) in Olbia/Sarmatia zwischen ca. 180 und 170 v. Chr.Lit.: W. Leschhorn, Lexikon der Aufschriften auf griechischen Münzen II (2009) 411 mit Anm. 10 (möglicherweise auch Amtstitel Basileus, Mitte 2. Jh. v. Chr.).
gender: male
surname: Bse...
function or role: Magistrat (Ant)
in scheme: person
created: 2026-01-09
modified: 2026-01-09
creator: mk berlin

Magistrat (Ant)
preferred label: Magistrate (Ant) @en