David III. (966-1001), König von Georgien
type: Concept
type: person
preferred label: David III (966-1001), king of Georgia @en
definition: Fürst von Tao seit 966. Trug den byzantinischen Titel Kuropalates seit 978.
gender: male
surname: David III. (966-1001), König von Georgien
surname: David III (966-1001), king of Georgia @en
date of death: 1001
date of birth and death: -1001?
function or role: Autorität
in scheme: person
created: 2026-01-13
creator: mk berlin

Autorität
preferred label: Authority @en