Theo...
type: Concept
type: person
definition: Archiereus in Olbia/Sarmatia im späten ersten Jahrhundert n. Chr.Erscheint mit dem Zusatz B (der Jüngere)Lit.: W. Leschhorn, Lexikon der Aufschriften auf griechischen Münzen II (2009) 546 (spätes 1. Jh. n. Chr.); RPC II Nr. 491 (spätes 1. Jh. n. Chr.).
gender: male
surname: Theo...
function or role: Archiereus
in scheme: person
created: 2026-01-13
modified: 2026-01-13
creator: mk berlin