Martin Turba
type: Concept
type: person
definition: Wardein in Wien 1621, Münzmeister in Wien von 1622 bis 1623, Münzmeister in St. Pölten von 1625 bis 1626.Münzmeisterzeichen Rose.Lit.: W. Hahn, Die Münzprägung der Habsburger im österreichischen Reichskreis von Maximilian I. bis Ferdinand III. (1490-1657) und: von Leopold I. bis zu den Reformen Maria Theresias (1657-1746) (2016) 116; L. Herinek, Österreichische Münzprägungen von 1592-1657 I (1984) 43; V. Miller zu Aichholz - A. Loehr - E. Holzmair, Österreichische Münzprägungen 1519-1938² (Nachdruck 1948) XXVII; L. Forrer, Biographical Dictionary of Medallists VI (1916) 150.
gender: male
forename: Martin
surname: Turba
date of death: 1626
date of birth and death: -1626
function or role: Münzmeister (MM Nz)
function or role: Münzwardein
in scheme: person
created: 2026-01-16
creator: mk berlin

Münzmeister (MM Nz)
preferred label: Mintmaster (MM Mod) @en

Münzwardein
preferred label: Warden @en