Johann Joachim Edling
type: Concept
type: person
definition: Münzmeister in Klagenfurt 1622, Münzpächter in Pressburg (Bratislava) 1624, Münzpächter in St. Pölten von 1624 bis 1625, Münzmeister in St. Pölten 1625.Münzmeisterzeichen Doppellilie sowie seine Initialen II, E.Lit.: W. Hahn, Die Münzprägung der Habsburger im österreichischen Reichskreis von Maximilian I. bis Ferdinand III. (1490-1657) und: von Leopold I. bis zu den Reformen Maria Theresias (1657-1746) (2016) 116; L. Herinek, Österreichische Münzprägungen von 1592-1657 I (1984) 43; V. Miller zu Aichholz - A. Loehr - E. Holzmair, Österreichische Münzprägungen 1519-1938² (Nachdruck 1948) XXVII, XXX; L. Forrer, Biographical Dictionary of Medallists II (1904) 8.
gender: male
forename: Johann Joachim
surname: Edling
function or role: Münzmeister (MM Nz)
function or role: Münzpächter
in scheme: person
created: 2026-01-16
creator: mk berlin

Münzmeister (MM Nz)
preferred label: Mintmaster (MM Mod) @en

Münzpächter
preferred label: Leaseholder @en