Hans Georg Perro
type: Concept
type: person
definition: Münzmeister in St. Veit von 1627 bis 1641?Münzmeisterzeichen Initialen HG.Lit.: W. Hahn, Die Münzprägung der Habsburger im österreichischen Reichskreis von Maximilian I. bis Ferdinand III. (1490-1657) und: von Leopold I. bis zu den Reformen Maria Theresias (1657-1746) (2016) 116; L. Herinek, Österreichische Münzprägungen von 1592–1657 I (1984) 44; G. Probszt, Studien zum Kärntner Münz- und Geldwesen in neuerer Zeit III (1958) 447 f.; V. Miller zu Aichholz - A. Loehr - E. Holzmair, Österreichische Münzprägungen 1519-1938² (Nachdruck 1948) XXVII; L. Forrer, Biographical Dictionary of Medallists II (1904) 233 (dort als Hans Gebhard).
gender: male
forename: Hans Georg
surname: Perro
date of birth: 1580
date of death: 1646
date of birth and death: um 1580-1646
function or role: Münzmeister (MM Nz)
in scheme: person
created: 2026-01-16
creator: mk berlin

Münzmeister (MM Nz)
preferred label: Mintmaster (MM Mod) @en