Paul Sigharter
type: Concept
type: person
definition: Münzmeister in St. Veit von 1625 bis 1628.Münzmeisterzeichen Initialen PS.Lit.: W. Hahn, Die Münzprägung der Habsburger im österreichischen Reichskreis von Maximilian I. bis Ferdinand III. (1490-1657) und: von Leopold I. bis zu den Reformen Maria Theresias (1657-1746) (2016) 116; L. Herinek, Österreichische Münzprägungen von 1592-1657 I (1984) 44; V. Miller zu Aichholz - A. Loehr - E. Holzmair, Österreichische Münzprägungen 1519-1938² (Nachdruck 1948) XXVII.
gender: male
forename: Paul
surname: Sigharter
function or role: Münzmeister (MM Nz)
in scheme: person
created: 2026-01-16
creator: mk berlin

Münzmeister (MM Nz)
preferred label: Mintmaster (MM Mod) @en