Richard Adolf Zutt
type: Concept
type: person
definition: Schweizer Bildhauer, Maler und Medailleur.
gender: male
forename: Richard Adolf
surname: Zutt
date of birth: 1887
date of death: 1938
date of birth and death: 25.01.1887 - 12.09.1938
function or role: Medailleur/in
in scheme: person
created: 2026-01-19
creator: mk berlin

Medailleur/in
preferred label: Medalist @en