Hans Dietrich
type: Concept
type: person
definition: Österreichischer Bildhauer und Medailleur.
gender: male
forename: Hans
surname: Dietrich
date of birth: 1868
date of death: 1936
date of birth and death: 30.06.1868 - 21.04.1936
function or role: Medailleur/in
in scheme: person
created: 2026-01-19
creator: mk berlin

Medailleur/in
preferred label: Medalist @en