Gustav Gurschner
type: Concept
type: person
definition: Österreichischer Bildhauer und Medailleur.
gender: male
forename: Gustav
surname: Gurschner
date of birth: 1873
date of death: 1970
date of birth and death: 28.09.1873 - 02.08.1970
function or role: Medailleur/in
in scheme: person
created: 2026-01-19
creator: mk berlin

Medailleur/in
preferred label: Medalist @en