Anthes…
type: Concept
type: person
definition: Magistrat in Sinope/Paphlagonien zwischen ca. 330 und 300 v. Chr.Lit.: W. Leschhorn, Lexikon der Aufschriften auf griechischen Münzen II (2009) p. 323.
gender: male
surname: Anthes…
function or role: Magistrat (Ant)
in scheme: person
created: 2026-02-05
creator: mk berlin

Magistrat (Ant)
preferred label: Magistrate (Ant) @en