Prof. Dr. Jan Six
type: Concept
type: person
definition: Niederländischer Kunsthistoriker, Archäologe und Sammler.
gender: male
prefix: Prof. Dr.
forename: Jan
surname: Six
date of birth: 1857
date of death: 1926
date of birth and death: 02.02.1857 - 08.12.1926
function or role: Vorbesitzer
in scheme: person
created: 2026-02-06
creator: mk berlin

Vorbesitzer
preferred label: previous Owner @en