Posi...
type: Concept
type: person
definition: Magistrat in Sinope/Paphlagonien zwischen ca. 410 und 350 v. Chr.Lit.: W. Leschhorn, Lexikon der Aufschriften auf griechischen Münzen II (2009) 772.
gender: male
surname: Posi...
function or role: Magistrat (Ant)
in scheme: person
created: 2026-02-07
creator: mk berlin

Magistrat (Ant)
preferred label: Magistrate (Ant) @en