Soběslav von Lubice (981-1004)
type: Concept
type: person
preferred label: Soběslav of Lubice (981-1004) @en
definition: Böhmischer Adliger. Herrscher aus dem Geschlecht der Slavnikiden
gender: male
surname: Soběslav von Lubice (981-1004)
surname: Soběslav of Lubice (981-1004) @en
date of birth: 950
date of death: 1004
date of birth and death: ca. 950-1004
function or role: Autorität
in scheme: person
created: 2026-03-16
modified: 2026-03-16
creator: mk berlin

Autorität
preferred label: Authority @en