Eliseus du Bois
type: Concept
type: person
definition: Auch Elias de Bois.Münzmeister in Prag von 1630 bis 1631.Münzmeisterzeichen Eberkopf.Lit.: I. Halačka, Regierungsmünzen der Länder der böhmischen Krone 1526-1856 (2011) 339; L. Herinek, Österreichische Münzprägungen von 1592-1657 I (1984) 44; V. Miller zu Aichholz - A. Loehr - E. Holzmair, Österreichische Münzprägungen 1519-1938² (Nachdruck 1948) XIX.
gender: male
forename: Eliseus du
surname: Bois
function or role: Münzmeister (MM Nz)
in scheme: person
created: 2026-04-02
modified: 2026-04-02
creator: mk berlin

Münzmeister (MM Nz)
preferred label: Mintmaster (MM Mod) @en