Simon Dyringer
type: Concept
type: person
preferred label: Šimon Dyringer @en
definition: Auch Šimon Dyringer.Münzmeister in Ratibor von 1624 bis 1625.Dyringer signiert mit seinen Initialen SD.Lit.: I. Halačka, Regierungsmünzen der Länder der böhmischen Krone 1526-1856 (2011) 343; L. Herinek, Österreichische Münzprägungen von 1592-1657 I (1984) 47; V. Miller zu Aichholz - A. Loehr - E. Holzmair, Österreichische Münzprägungen 1519-1938² (Nachdruck 1948) XX.
gender: male
forename: Simon
forename: Šimon @en
surname: Dyringer
function or role: Münzmeister (MM Nz)
in scheme: person
created: 2026-04-02
modified: 2026-04-02
creator: mk berlin

Münzmeister (MM Nz)
preferred label: Mintmaster (MM Mod) @en