Hans Gebhardt/Gebhart
type: Concept
type: person
definition: Stempelschneider in Brünn, tätig 1624.Gebhardt signiert mit seinen Initialen HG.Lit.: L. Herinek, Österreichische Münzprägungen von 1592-1657 I (1984) 45; L. Forrer, Biographical Dictionary of Medallists II (1904) 233.
gender: male
forename: Hans
surname: Gebhardt/Gebhart
function or role: Stempelschneider
in scheme: person
created: 2026-04-02
creator: mk berlin

Stempelschneider
preferred label: Die-cutter @en