Hans Prunz
type: Concept
type: person
preferred label: Hanuš Prunz @en
definition: Auch Hanns oder Hanuš Prunz.Münzmeister in Kuttenberg von 1633 bis 1635.Münzmeisterzeichen gekreuzte Hämmer.Lit.: I. Halačka, Regierungsmünzen der Länder der böhmischen Krone 1526-1856 (2011) 339; L. Herinek, Österreichische Münzprägungen von 1592-1657 I (1984) 44; V. Miller zu Aichholz - A. Loehr - E. Holzmair, Österreichische Münzprägungen 1519-1938² (Nachdruck 1948) XIX; L. Forrer, Biographical Dictionary of Medallists IV (1909) 706.
gender: male
forename: Hans
forename: Hanuš @en
surname: Prunz
function or role: Münzmeister (MM Nz)
in scheme: person
created: 2026-04-02
modified: 2026-04-02
creator: mk berlin

Münzmeister (MM Nz)
preferred label: Mintmaster (MM Mod) @en