Dorothea Schuster
type: Concept
type: person
preferred label: Dorota Schusterová @en
definition: Auch Dorota Schusterová, Dorothea Schusterin.Münzmeisterin in Prag von 1636 bis 1637.Lit.: I. Halačka, Regierungsmünzen der Länder der böhmischen Krone 1526-1856 (2011) 339; L. Forrer, Biographical Dictionary of Medallists V (1912) 410.
gender: female
forename: Dorothea
forename: Dorota @en
surname: Schuster
surname: Schusterová @en
function or role: Münzmeister (MM Nz)
in scheme: person
created: 2026-04-02
modified: 2026-04-02
creator: mk berlin

Münzmeister (MM Nz)
preferred label: Mintmaster (MM Mod) @en