Patricia Lewis Verani
type: Concept
type: person
definition: Amerikanische Medailleurin und Münzentwerferin.
gender: female
forename: Patricia
surname: Lewis Verani
date of birth: 1927
date of death: 2017
date of birth and death: 02.01.1927 - 15.12.2017
function or role: Entwurf
function or role: Medailleur/in
in scheme: person
created: 2026-04-08
creator: mk berlin

Entwurf
preferred label: Design @en

Medailleur/in
preferred label: Medalist @en