Paolo Emilio Galeotti
type: Concept
type: person
definition: Päpstlicher Münzmeister in Gubbio von ca. 1648 bis 1686.Lit.: L. Forrer, Biographical Dictionary of Medallist II (1904) 190.
gender: male
forename: Paolo Emilio
surname: Galeotti
function or role: Münzmeister (MM Nz)
in scheme: person
created: 2026-04-09
creator: mk berlin

Münzmeister (MM Nz)
preferred label: Mintmaster (MM Mod) @en