Michael Iacocca
type: Concept
type: person
definition: Medailleur an der Münzstätte Philadelphia.
gender: male
forename: Michael
surname: Iacocca
date of birth: 1912
date of death: 1998
date of birth and death: 12.02.1912 - 30.09.1998
function or role: Medailleur/in
in scheme: person
created: 2026-04-14
modified: 2026-04-14
creator: mk berlin

Medailleur/in
preferred label: Medalist @en