Thomas Hudson Jones
type: Concept
type: person
definition: Amerikanischer Bildhauer und Medailleur.
gender: male
forename: Thomas Hudson
surname: Jones
date of birth: 1892
date of death: 1969
date of birth and death: 24.07.1892 - 04.11.1969
function or role: Medailleur/in
in scheme: person
created: 2026-04-14
creator: mk berlin

Medailleur/in
preferred label: Medalist @en