Georg Vogel
type: Concept
type: person
definition: Münzmeister in Arnstadt von 1555 bis nach 1571.Lit.: E. Fischer, Die Münzen des Hauses Schwarzburg. Ein Beitrag zur Landesgeschichte der Fürstentümer Schwarzburg-Sondershausen und Schwarzburg-Rudolstadt (1904) 45.
gender: male
forename: Georg
surname: Vogel
function or role: Münzmeister (MM Nz)
in scheme: person
created: 2026-04-30
modified: 2026-04-30
creator: mk berlin

Münzmeister (MM Nz)
preferred label: Mintmaster (MM Mod) @en