Phi...
type: Concept
type: person
definition: Magistrat in Olbia/Sarmatien zwischen ca. 320 und 280 v. Chr.Lit.: W. Leschhorn, Lexikon der Aufschriften auf griechischen Münzen II (2009) 866 (ca. 320-300 v. Chr.).
gender: male
surname: Phi...
function or role: Magistrat (Ant)
in scheme: person
created: 2026-05-11
modified: 2026-05-11
creator: mk berlin

Magistrat (Ant)
preferred label: Magistrate (Ant) @en