Pho...
type: Concept
type: person
definition: Magistrat in Olbia/Sarmatien zwischen ca. 250 und 240 v. Chr.Vgl. den (namensgleichen?) Magistraten Phob.../Phobe... in Olbia 380/360 v. Chr.Lit.: W. Leschhorn, Lexikon der Aufschriften auf griechischen Münzen II (2009) 882 (4./3. Jahrhundert v. Chr.).
gender: male
surname: Pho...
function or role: Magistrat (Ant)
in scheme: person
created: 2026-05-11
modified: 2026-05-11
creator: mk berlin

Magistrat (Ant)
preferred label: Magistrate (Ant) @en