Francesco Baffo
type: Concept
type: person
definition: Münzmeister in Venedig im Jahre 1474.Lit.: E. Montenegro, I Dogi e le loro Monete (2012) XXVIII; W. R. Day Jr. - M. Matzke - A. Saccocci, Medieval European Coinage XII-1 (2016) 1050.
gender: male
forename: Francesco
surname: Baffo
function or role: Münzmeister (MM Nz)
in scheme: person
created: 2026-05-20
creator: mk berlin

Münzmeister (MM Nz)
preferred label: Mintmaster (MM Mod) @en