Felice Bon
type: Concept
type: person
definition: Münzmeister in Venedig im Jahre 1576.Lit.: E. Montenegro, I Dogi e le loro Monete (2012) XXIX.
gender: male
forename: Felice
surname: Bon
function or role: Münzmeister (MM Nz)
in scheme: person
created: 2026-05-20
creator: mk berlin

Münzmeister (MM Nz)
preferred label: Mintmaster (MM Mod) @en