Franz Ignaz Wurschbauer
type: Concept
type: person
definition: Österreichischer Medailleur und Stempelschneider an den Münzstättn Kremnitz, Hall, Gratz und Wien.Lit.: L. Forrer, Bibliographical Dictionary of Medallists VI (1916) 561 f.
gender: male
forename: Franz Ignaz
surname: Wurschbauer
date of death: 1767
date of birth and death: -02.06.1767
function or role: Medailleur/in
function or role: Stempelschneider
in scheme: person
created: 2026-06-12
modified: 2026-06-12
creator: mk berlin

Medailleur/in
preferred label: Medalist @en

Stempelschneider
preferred label: Die-cutter @en