Wenzel Haynl
type: Concept
type: person
definition: Österreichischer Medailleur.Lit.: L. Forrer, Bibliographical Dictionary of Medallists VII (1923) 426.
gender: male
forename: Wenzel
surname: Haynl
date of death: 1779
date of birth and death: -06.01.1779
function or role: Medailleur/in
in scheme: person
created: 2026-06-12
creator: mk berlin

Medailleur/in
preferred label: Medalist @en