Thomas Shields Clarke
type: Concept
type: person
definition: Amerikanischer Maler, Bildhauer und Medailleur.
gender: male
forename: Thomas Shields
surname: Clarke
date of birth: 1860
date of death: 1920
date of birth and death: 25.04.1860 - 15.11.1920
function or role: Medailleur/in
in scheme: person
created: 2026-06-12
creator: mk berlin

Medailleur/in
preferred label: Medalist @en