Giuseppe Antonio Toda
type: Concept
type: person
definition: Italienischer Medailleur in habsburgischen Diensten.Tätig in der Münzstätte Wien.Lit.: L. Forrer, Bibliographical Dictionary of Medallists VI (1923) 108.
gender: male
forename: Giuseppe Antonio
surname: Toda
date of birth: 1710
date of death: 1768
date of birth and death: 1710-1768
function or role: Medailleur/in
in scheme: person
created: 2026-06-13
modified: 2026-06-13
creator: mk berlin

Medailleur/in
preferred label: Medalist @en