Pierre-Auguste Renoir
type: Concept
type: person
definition: Französischer Maler.Fertigte auch einige Medaillen.
gender: male
forename: Pierre-Auguste
surname: Renoir
date of birth: 1841
date of death: 1919
date of birth and death: 25.02.1841 - 03.12.1919
function or role: Medailleur/in
in scheme: person
created: 2026-06-23
creator: mk berlin

Medailleur/in
preferred label: Medalist @en