Ferdinand Levillain
type: Concept
type: person
definition: Französischer Bildhauer und Medailleur.Lit.: L. Forrer, Biographical Dictionary of Medallists III (1907) 425-427
gender: male
forename: Ferdinand
surname: Levillain
date of birth: 1837
date of death: 1905
date of birth and death: 29.07.1837 - 08.01.1905
function or role: Medailleur/in
in scheme: person
created: 2026-06-24
modified: 2026-06-24
creator: mk berlin

Medailleur/in
preferred label: Medalist @en