Hans Sandreuter
type: Concept
type: person
definition: Schweizer Maler, der gelegentlich auch Medaillen fertigte.Lit.: L. Forrer, Biographical Dictionary of Medallists V (1912) 323.
gender: male
forename: Hans
surname: Sandreuter
date of birth: 1850
date of death: 1901
date of birth and death: 11.05.1850 - 01.06.1901
function or role: Medailleur/in
in scheme: person
created: 2026-06-24
modified: 2026-06-24
creator: mk berlin

Medailleur/in
preferred label: Medalist @en