Paul Jouve
type: Concept
type: person
definition: Französischer Bildhauer und Medailleur.Lit.: L. Forrer, Biographical Dictionary of Medallists VII (1923) 491.
gender: male
forename: Paul
surname: Jouve
date of birth: 1878
date of death: 1973
date of birth and death: 16.03.1878 - 13.05.1973
function or role: Medailleur/in
in scheme: person
created: 2026-06-24
creator: mk berlin

Medailleur/in
preferred label: Medalist @en