Paul Dubois
type: Concept
type: person
definition: Französischer Maler, Bildhauer und Medailleur.Lit.: L. Forrer, Biographical Dictionary of Medallists I (1904) 639.
gender: male
forename: Paul
surname: Dubois
date of birth: 1829
date of death: 1905
date of birth and death: 18.07.1829 - 22.05.1905
function or role: Medailleur/in
in scheme: person
created: 2026-06-24
creator: mk berlin

Medailleur/in
preferred label: Medalist @en