Oscar Nemon
type: Concept
type: person
definition: Kroatisch-Britischer Bildhauer und Medailleur.Münzentwurf Großbritannien.
gender: male
forename: Oscar
surname: Nemon
date of birth: 1906
date of death: 1985
date of birth and death: 13.03.1906 - 13.04.1985
function or role: Entwurf
function or role: Medailleur/in
in scheme: person
created: 2026-06-24
creator: mk berlin

Entwurf
preferred label: Design @en

Medailleur/in
preferred label: Medalist @en