Prof. Dr. Mark Lidzbarski
type: Concept
type: person
definition: Deutsch-polnischer Philologe und Semitist.
gender: male
prefix: Prof. Dr.
forename: Mark
surname: Lidzbarski
date of birth: 1868
date of death: 1928
date of birth and death: 07.01.1868 - 13.11.1928
function or role: Dargestellte/r
in scheme: person
created: 2026-06-26
modified: 2026-06-26
creator: mk berlin

Dargestellte/r
preferred label: Sitter @en