Prof. Dr. Nikolaus Rhodokanakis
type: Concept
type: person
definition: Griechisch-Österreichischer Semitist und Arabist.
gender: male
prefix: Prof. Dr.
forename: Nikolaus
surname: Rhodokanakis
date of birth: 1876
date of death: 1945
date of birth and death: 08.04.1876 - 30.12.1945
function or role: Geehrte/r (ohne Bildnis)
in scheme: person
created: 2026-06-26
creator: mk berlin

Geehrte/r (ohne Bildnis)
preferred label: honored person (no portrait) @en