Andreas Christoph Blechschmitt
type: Concept
type: person
definition: Münzwardein in Braunschweig von 1732 bis 1751.Münzmeister in Braunschweig von 1751 bis 1760.
gender: male
forename: Andreas Christoph
surname: Blechschmitt
date of birth: 1700
date of death: 1760
date of birth and death: um 1700-1760
function or role: Münzmeister (MM Nz)
function or role: Münzwardein
in scheme: person
created: 2026-07-01
creator: mk berlin

Münzmeister (MM Nz)
preferred label: Mintmaster (MM Mod) @en

Münzwardein
preferred label: Warden @en